===> /Fhypatia/roger/prod/xhs/src/xpp/sun
CC -g -pg  -I. -I.. -I../../xpp -I../../xlatexpp -I../../comm -I../sxx -I../../xpp -I../../platform/sun -I../../disk -I/usr/local/lang/SC1.0/include/CC -I/usr/local/lang/SC1.0/include -I/usr/include   -DUSE_INLINE   -sun4 -o bombt.exe bombt.o bombx.o ccompatc.o -lm  
csh -c './bombt.exe >& bomb.out && true'
rm bombt.exe
(diff ../bomb.ref bomb.out > bomb.dif) || (sleep 1; touch bomb.out; false)
touch bomb.dif
cd ../../xlatexpp/sun ; xumake xxpplibx.o || (rm -f ../../xlatexpp/sun/xxpplibx.o ; false)
===> /Fhypatia/roger/prod/xhs/src/xlatexpp/sun
`xxpplibx.o' is up to date.
cd ../../xlatexpp/sun ; xumake spclibx.o || (rm -f ../../xlatexpp/sun/spclibx.o ; false)
===> /Fhypatia/roger/prod/xhs/src/xlatexpp/sun
`spclibx.o' is up to date.
cd ../../comm/sun ; xumake commlibx.o || (rm -f ../../comm/sun/commlibx.o ; false)
===> /Fhypatia/roger/prod/xhs/src/comm/sun
`commlibx.o' is up to date.
CC -g -pg  -I. -I.. -I../../xpp -I../../xlatexpp -I../../comm -I../sxx -I../../xpp -I../../platform/sun -I../../disk -I/usr/local/lang/SC1.0/include/CC -I/usr/local/lang/SC1.0/include -I/usr/include   -DUSE_INLINE   -sun4 -o fluidt.exe fluidt.o xpplibx.o filetpx.o ../../xlatexpp/sun/xxpplibx.o ../../xlatexpp/sun/spclibx.o ../../comm/sun/commlibx.o -lm  
csh -c './fluidt.exe >& fluid.out && true'
rm fluidt.exe
(diff ../fluid.ref fluid.out > fluid.dif) || (sleep 1; touch fluid.out; false)
touch fluid.dif
(diff ../tofu.ref tofu.out > tofu.dif) || (sleep 1; touch tofu.out; false)
*** Error code 1
(CC -g -pg  -I. -I.. -I../../xpp -I../../xlatexpp -I../../comm -I../sxx -I../../xpp -I../../platform/sun -I../../disk -I/usr/local/lang/SC1.0/include/CC -I/usr/local/lang/SC1.0/include -I/usr/include   -DUSE_INLINE   -sun4 -c  ../parrayt.cxx && (ld -r parrayt.o ; rm -f parrayt.o ; mv a.out parrayt.o ; touch parrayt.o; true)) || (rm -f parrayt.o; false)
"../parrayt.cxx", line 64: error:  member myHeap undefined
"../parrayt.cxx", line 97: warning:  dst not used
Compilation failed
*** Error code 1
make: Warning: Don't know how to make target `parray.dif'
(diff ../alloc.ref alloc.out > alloc.dif) || (sleep 1; touch alloc.out; false)
*** Error code 1
(diff ../fhash.ref fhash.out > fhash.dif) || (sleep 1; touch fhash.out; false)
*** Error code 1
(CC -g -pg  -I. -I.. -I../../xpp -I../../xlatexpp -I../../comm -I../sxx -I../../xpp -I../../platform/sun -I../../disk -I/usr/local/lang/SC1.0/include/CC -I/usr/local/lang/SC1.0/include -I/usr/include   -DUSE_INLINE   -sun4 -c  ../opaquet.cxx && (ld -r opaquet.o ; rm -f opaquet.o ; mv a.out opaquet.o ; touch opaquet.o; true)) || (rm -f opaquet.o; false)
"../opaquet.cxx", line 119: error:  type mismatch: SP2_Bar   == SP2_Baz 
"../opaquet.cxx", line 128: error:  type mismatch: Bar *  == SP2_Baz 
"../opaquet.cxx", line 137: error:  type mismatch: SP2_Bar   == Baz *
"../opaquet.cxx", line 147: error:  type mismatch: SP2_Bar   == SP2_Baz 
Compilation failed
*** Error code 1
make: Warning: Don't know how to make target `opaque.dif'
cc -g -pg -I. -I.. -I../../xpp -I../../xlatexpp -I../../comm -I../sxx -I../../xpp -I../../platform/sun -I../../disk -I/usr/local/lang/SC1.0/include/CC -I/usr/local/lang/SC1.0/include -I/usr/include  -sun4 -c  ../cbombt.c
"/usr/local/lang/SC1.0/include/CC/stdlib.h", line 64: syntax error at or near type word "char"
Compilation failed
*** Error code 1
make: Warning: Don't know how to make target `cbomb.dif'
(diff ../scav.ref scav.out > scav.dif) || (sleep 1; touch scav.out; false)
*** Error code 1
make: Warning: Target `tests' not remade because of errors
